{"text_format":"1","workbook":"xlsx","n_sheets":54,"sheets":["Acceuil","Parcelle","Saisie","SYNTHSESE","EXPORT_EXCEL","CN_def","Azote_def","Carbone_def","MO_def","CaO_def","CaCO3_def","pH_def","Granulo_def","CEC_def","Granulo","Feuil7","RFU","Battance","Ratio_Mineraux","Apport_MgO","Reserve_sol","Evolution","Ref_MO","Stock_sol","Bilan_Humique","MO","C-N","CEC","pH","Variation_pH","pH (2)","Chaulage","Chaulage (2)","BDD_Chaulage","PK","Calcul_Seuils_PK","Calcul_PK","BDD_Engrais_PK","Choix_engrais_phosphore","Feuil9","BDD_Potasse","BDD_Phosphore","BDD_Phosphore_JH","BDD_Phosphore_Olsen","BDD_Phosphore_Dyer","Exigence_PK","Feuil6","Feuil1","Ref_tab_graph","BDD_parcelles","Feuil2","Feuil3","Feuil5","Feuil4"],"not_rendered":{"charts":20,"images":78,"macros":1,"external_links":0,"defined_names":1,"comments":0,"pivot_tables":0},"unopened":[],"bounds":{"document_bytes":16777216,"sheet_cells":100000,"rows_first":2000,"rows_last":500,"rows_between":2000,"halvings":0,"cell_chars":16384,"cell_head_chars":4096},"cells_cut":0,"cells_raw":0,"read":"whole","date_system":"1900"}

{"sheet":"Acceuil","index":0,"n_rows":0,"n_cols":0,"rows_kept":0,"cut":false,"hidden":false,"merged":[]}

{"sheet":"Parcelle","index":1,"n_rows":20,"n_cols":2,"rows_kept":20,"cut":false,"hidden":false,"merged":[[20,1,30,3],[19,1,19,3]]}
[]
[]
[]
[]
[]
[]
[]
[]
{"$rows_left_out":13}
{"sheet":"Saisie","index":2,"n_rows":30,"n_cols":14,"rows_kept":30,"cut":false,"hidden":false,"merged":[]}
[]
[]
[]
[]
[null,null,"Saisie les données issues de votre analyse de sol dans les cases ci-dessous."]
[]
[]
[null,null,null,null,null,null,null,null,null,null,"CEC (meq/100g)"]
{"$rows_left_out":23}
{"sheet":"SYNTHSESE","index":3,"n_rows":341,"n_cols":14,"rows_kept":341,"cut":false,"hidden":false,"merged":[[340,1,347,11],[7,8,7,9]]}
[]
[]
[]
[]
[]
[]
[]
["Nom de l'agriculteur : ",null,{"$f":"Parcelle!C9","v":0},null,null,null,null,"Date :",{"$f":"TODAY()","v":"2022-05-10"}]
{"$rows_left_out":334}
{"sheet":"EXPORT_EXCEL","index":4,"n_rows":49,"n_cols":6,"rows_kept":49,"cut":false,"hidden":false,"merged":[]}
[]
[]
[]
[]
[]
[null,"Nom",{"$f":"Parcelle!C9","v":0}]
[]
[null,{"$f":"Saisie!C9","v":"Argile (%)"},{"$f":"Saisie!D9","v":25}]
{"$rows_left_out":42}
{"sheet":"CN_def","index":5,"n_rows":0,"n_cols":0,"rows_kept":0,"cut":false,"hidden":false,"merged":[]}

{"sheet":"Azote_def","index":6,"n_rows":0,"n_cols":0,"rows_kept":0,"cut":false,"hidden":false,"merged":[]}

{"sheet":"Carbone_def","index":7,"n_rows":0,"n_cols":0,"rows_kept":0,"cut":false,"hidden":false,"merged":[]}

{"sheet":"MO_def","index":8,"n_rows":0,"n_cols":0,"rows_kept":0,"cut":false,"hidden":false,"merged":[]}

{"sheet":"CaO_def","index":9,"n_rows":0,"n_cols":0,"rows_kept":0,"cut":false,"hidden":false,"merged":[]}

{"sheet":"CaCO3_def","index":10,"n_rows":0,"n_cols":0,"rows_kept":0,"cut":false,"hidden":false,"merged":[]}

{"sheet":"pH_def","index":11,"n_rows":0,"n_cols":0,"rows_kept":0,"cut":false,"hidden":false,"merged":[]}

{"sheet":"Granulo_def","index":12,"n_rows":0,"n_cols":0,"rows_kept":0,"cut":false,"hidden":false,"merged":[]}

{"sheet":"CEC_def","index":13,"n_rows":0,"n_cols":0,"rows_kept":0,"cut":false,"hidden":false,"merged":[]}

{"sheet":"Granulo","index":14,"n_rows":31,"n_cols":10,"rows_kept":31,"cut":false,"hidden":false,"merged":[]}
[]
[]
[]
[]
[]
[null,null,"MO (%)",{"$f":"Saisie!F26","v":3}]
[null,null,"Argile (%)",{"$f":"Saisie!D9","v":25}]
[null,null,"Limons fins (%)",{"$f":"Saisie!D10","v":30}]
{"$rows_left_out":24}
{"sheet":"Feuil7","index":15,"n_rows":0,"n_cols":0,"rows_kept":0,"cut":false,"hidden":false,"merged":[]}

{"sheet":"RFU","index":16,"n_rows":30,"n_cols":6,"rows_kept":30,"cut":false,"hidden":false,"merged":[]}
[]
[null,{"$f":"Granulo!C7","v":"Argile (%)"},{"$f":"Saisie!D9","v":25}]
[null,{"$f":"Granulo!C8","v":"Limons fins (%)"},{"$f":"Granulo!D8","v":30}]
[null,{"$f":"Granulo!C9","v":"Limons grossiers (%)"},{"$f":"Granulo!D9","v":35}]
[null,"Limon",{"$f":"SUM(C3:C4)","v":65}]
[]
[]
[]
{"$rows_left_out":23}
{"sheet":"Battance","index":17,"n_rows":0,"n_cols":0,"rows_kept":0,"cut":false,"hidden":false,"merged":[]}

{"sheet":"Ratio_Mineraux","index":18,"n_rows":68,"n_cols":14,"rows_kept":68,"cut":false,"hidden":false,"merged":[]}
[]
[]
[]
[]
[]
[null,null,null,null,null,null,"Fe / Mn","Votre valeur","Valeur recherchée",null,null,"Zinc","Votre valeur",{"$f":"Saisie!N24","v":0}]
[null,null,null,null,null,null,"Fer",{"$f":"J7/J8","v":{"$error":"#DIV/0!"}},2,{"$f":"Saisie!N27","v":0}]
[null,null,null,null,null,null,"Manganèse",{"$f":"J8/J8","v":{"$error":"#DIV/0!"}},1,{"$f":"Saisie!N25","v":0}]
{"$rows_left_out":61}
{"sheet":"Apport_MgO","index":19,"n_rows":49,"n_cols":20,"rows_kept":49,"cut":false,"hidden":false,"merged":[]}
[]
[]
[]
[]
[]
[]
[]
[]
{"$rows_left_out":42}
{"sheet":"Reserve_sol","index":20,"n_rows":18,"n_cols":6,"rows_kept":18,"cut":false,"hidden":false,"merged":[]}
[]
[]
[]
[]
["Teneur en MO",0.05,null,null,null,122]
[null,null,null,null,null,1.5]
["% cailloux",100]
["profondeur de travail du sol",20,null,null,null,1831]
{"$rows_left_out":11}
{"sheet":"Evolution","index":21,"n_rows":0,"n_cols":0,"rows_kept":0,"cut":false,"hidden":false,"merged":[]}

{"sheet":"Ref_MO","index":22,"n_rows":0,"n_cols":0,"rows_kept":0,"cut":false,"hidden":false,"merged":[]}

{"sheet":"Stock_sol","index":23,"n_rows":63,"n_cols":16,"rows_kept":63,"cut":false,"hidden":false,"merged":[]}
[]
[]
[]
[]
[]
[null,null,null,null,null,null,null,null,null,null,null,null,null,"Profondeur prélevée (cm)",null,25]
[null,null,null,null,null,null,null,null,null,null,null,null,null,"Densité apprente",null,1.4]
[null,null,null,null,null,null,null,null,null,null,null,null,null,"Terre fine (%)",null,80]
{"$rows_left_out":56}
{"sheet":"Bilan_Humique","index":24,"n_rows":98,"n_cols":17,"rows_kept":98,"cut":false,"hidden":false,"merged":[]}
[]
[]
[]
[]
[]
[null,null,null,"ANNEE 1","ANNEE 2","ANNEE 3","ANNEE 4","ANNEE 5",null,null,null,null,null,"Profondeur prélevée (cm)",null,15]
[null,null,"CULTURES",1,1,1,1,1,null,null,null,null,null,"Densité apprente",null,1.4]
[null,null,"Rendement (t/ha)",null,null,null,null,null,null,null,null,null,null,"Terre fine (%)",null,100]
{"$rows_left_out":91}
{"sheet":"MO","index":25,"n_rows":30,"n_cols":16,"rows_kept":30,"cut":false,"hidden":false,"merged":[]}
[]
[]
[]
[]
[]
[null,null,"MO (%)",{"$f":"Saisie!F26","v":3}]
[null,null,"Argile (%)",{"$f":"Saisie!D9","v":25}]
[null,null,"Limons fins (%)",{"$f":"Saisie!D10","v":30}]
{"$rows_left_out":23}
{"sheet":"C-N","index":26,"n_rows":9,"n_cols":4,"rows_kept":9,"cut":false,"hidden":false,"merged":[]}
[]
[]
[]
[]
[]
[]
[null,null,{"$f":"Saisie!C29","v":"C/N"},{"$f":"Saisie!F29","v":0}]
[null,null,{"$f":"Saisie!C18","v":"pH eau"},{"$f":"Saisie!F18","v":6.4}]
{"$rows_left_out":2}
{"sheet":"CEC","index":27,"n_rows":50,"n_cols":5,"rows_kept":50,"cut":false,"hidden":false,"merged":[]}
[]
[]
[]
[]
[]
[null,null,{"$f":"Saisie!K8","v":"CEC (meq/100g)"},{"$f":"Saisie!L8","v":0}]
[null,null,{"$f":"Saisie!K9","v":"Ca/ CEC (%)"},{"$f":"Saisie!L9","v":0}]
[null,null,{"$f":"Saisie!K10","v":"K/CEC (%)"},{"$f":"Saisie!L10","v":0}]
{"$rows_left_out":43}
{"sheet":"pH","index":28,"n_rows":9,"n_cols":10,"rows_kept":9,"cut":false,"hidden":false,"merged":[]}
[]
[]
[]
[]
[]
[null,null,{"$f":"Saisie!C18","v":"pH eau"},{"$f":"Saisie!F18","v":6.4},{"$f":"IF(D6<8, D6, 8)","v":6.4}]
[null,null,{"$f":"Saisie!C19","v":"pH Kcl"},{"$f":"Saisie!F19","v":0},null,null,null,null,{"$f":"E6-D7","v":6.4},"point(s)"]
[null,null,{"$f":"Saisie!C20","v":"CaCO3 total %"},{"$f":"Saisie!F20","v":0},null,null,null,null,{"$f":"IF(E6>6.5,\"\",IF(I7<0.5,\"Amendement à prévoir à moyen terme\",IF(I7<1,\"Amendement à prévoir à court terme\",IF(I7>1,\"Amendement à prévoir rapidement\",0))))","v":"Amendement à prévoir rapidement"}]
{"$rows_left_out":2}
{"sheet":"Variation_pH","index":29,"n_rows":0,"n_cols":0,"rows_kept":0,"cut":false,"hidden":false,"merged":[]}

{"sheet":"pH (2)","index":30,"n_rows":9,"n_cols":10,"rows_kept":9,"cut":false,"hidden":false,"merged":[]}
[]
[]
[]
[]
[]
[null,null,{"$f":"Saisie!C18","v":"pH eau"},{"$f":"Saisie!F18","v":6.4}]
[null,null,{"$f":"Saisie!C19","v":"pH Kcl"},{"$f":"Saisie!F19","v":0},null,null,null,null,{"$f":"D6-D7","v":6.4},"point(s)"]
[null,null,{"$f":"Saisie!C20","v":"CaCO3 total %"},{"$f":"Saisie!F20","v":0},null,null,null,null,{"$f":"IF(D6>6.5,\"\",IF(I7<0.5,\"Amendement à prévoir à moyen terme\",IF(I7<1,\"Amendement à prévoir à court terme\",IF(I7>1,\"Amendement à prévoir rapidement\",0))))","v":"Amendement à prévoir rapidement"}]
{"$rows_left_out":2}
{"sheet":"Chaulage","index":31,"n_rows":30,"n_cols":23,"rows_kept":30,"cut":false,"hidden":false,"merged":[]}
[]
[]
[]
[]
[]
[]
[null,null,{"$f":"Saisie!C18","v":"pH eau"},{"$f":"Saisie!F18","v":6.4}]
[null,null,{"$f":"Saisie!C19","v":"pH Kcl"},{"$f":"Saisie!F19","v":0}]
{"$rows_left_out":23}
{"sheet":"Chaulage (2)","index":32,"n_rows":49,"n_cols":21,"rows_kept":49,"cut":false,"hidden":false,"merged":[]}
[]
[]
[]
[]
[]
[null,null,{"$f":"Saisie!C18","v":"pH eau"},{"$f":"Saisie!F18","v":6.4},null,"Type d'amendement basique recommandé (consulter base de données pour le choix)"]
[null,null,{"$f":"Saisie!C19","v":"pH Kcl"},{"$f":"Saisie!F19","v":0},null,{"$f":"IF(D6>=6.5, \"Pas d'intervention à prévoir\", IF(D6<5.5, \"Action rapide\", IF(D6<6, \"Action moyenne à rapide\", IF(D6<6.5, \"Action moyenne à lente\", \"Action moyenne à lente\"))))","v":"Action moyenne à lente"}]
[null,null,{"$f":"Saisie!C20","v":"CaCO3 total %"},{"$f":"Saisie!F20","v":0}]
{"$rows_left_out":42}
{"sheet":"BDD_Chaulage","index":33,"n_rows":24,"n_cols":6,"rows_kept":24,"cut":false,"hidden":false,"merged":[]}
[]
[]
[null,"LES AMENDEMENTS CALCIQUES ET MAGNESIENS"]
[]
[]
[]
[]
[]
{"$rows_left_out":17}
{"sheet":"PK","index":34,"n_rows":172,"n_cols":24,"rows_kept":172,"cut":false,"hidden":false,"merged":[[17,2,17,7]]}
[]
[]
[null,null,null,null,null,null,null,null,"Situation de votre parcelle"]
[null,null,null,null,null,null,null,null,1,null,null,null,null,null,null,null,null,null,null,null,null,null,null,"Code"]
[null,null,{"$f":"Saisie!K20","v":"P2O5 (mg/kg)"},{"$f":"Saisie!N20","v":0},2,null,"Région",3,"Phosphore",{"$f":"IF($E$63=1, \"X\", \" \")","v":" "},{"$f":"IF($E$63=2, \"X\", \" \")","v":" "},{"$f":"IF($E$63=3, \"X\", \" \")","v":" "},{"$f":"IF($E$63=4, \"X\", \" \")","v":" "},{"$f":"IF($E$63=5, \"X\", \" \")","v":" "},{"$f":"IF($E$63=6, \"X\", \" \")","v":" "},{"$f":"IF($E$63=7, \"X\", \" \")","v":" "},null,null,null,null,{"$f":"U6-1","v":2},"Concatener",{"$f":"CONCATENATE(U5,U7)","v":"21"},{"$f":"VLOOKUP(W6, BDD_Phosphore!K4:L90, 2)","v":5}]
[null,null,{"$f":"Saisie!K21","v":"K2O (mg/kg)"},{"$f":"Saisie!N21","v":0},null,null,null,null,"Potasse",{"$f":"IF($E$64=1, \"X\", \" \")","v":" "},{"$f":"IF($E$64=2, \"X\", \" \")","v":" "},{"$f":"IF($E$64=3, \"X\", \" \")","v":" "},{"$f":"IF($E$64=4, \"X\", \" \")","v":" "},{"$f":"IF($E$64=5, \"X\", \" \")","v":" "},{"$f":"IF($E$64=6, \"X\", \" \")","v":" "},{"$f":"IF($E$64=7, \"X\", \" \")","v":" "},null,null,null,null,{"$f":"H5","v":3},"Region",{"$f":"INDEX(U11:V172,W5,2)","v":21}]
[null,null,null,null,null,null,"Type de sol",1,null,null,null,null,null,null,null,null,null,null,null,null,{"$f":"H7","v":1},"Type sol"]
[]
{"$rows_left_out":165}
{"sheet":"Calcul_Seuils_PK","index":35,"n_rows":84,"n_cols":20,"rows_kept":84,"cut":false,"hidden":false,"merged":[]}
[]
[0,null,"Enfouis"]
[1,null,"Exportés"]
["2 ou +",null,null,null,null,null,null,null,null,null,null,null,null,null,{"$f":"PK!C5","v":"P2O5 (mg/kg)"},{"$f":"PK!D5","v":0}]
[]
["PHOSPHORE",null,"Trenf","Timp-10%","Timp","Timp+10%","2xTimp","3xTimp",null,null,null,null,null,null,"Trenf","Timp-10%","Timp","Timp+10%","2xTimp","3xTimp"]
[null,"Nombres d'années sans apport"]
["Très exigeantes",0,2.2000000000000002,1.5,1.2,1,0.8,0,0]
{"$rows_left_out":77}
{"sheet":"Calcul_PK","index":36,"n_rows":31,"n_cols":16,"rows_kept":31,"cut":false,"hidden":false,"merged":[]}
[]
[]
[]
[null,"Numero culture","Numero tableau region",null,null,null,1,{"$f":"IF(K4=0,\"\", K4)","v":"Champagne Ardenne"},null,null,{"$f":"INDEX($A$23:$P$31,G4,PK!H5)","v":"Champagne Ardenne"}]
[null,null,null,null,null,null,2,{"$f":"IF(K5=0,\"\", K5)","v":"Craie"},null,null,{"$f":"INDEX($A$23:$P$31,G5,PK!H5)","v":"Craie"}]
["Nord Picardie",1,1,null,null,null,3,"Limon",null,null,{"$f":"INDEX($A$23:$P$31,G6,PK!H5)","v":"Limon"}]
["Champagne Ardenne",2,5,null,null,null,4,"Limon argileux",null,null,{"$f":"INDEX($A$23:$P$31,G7,PK!H5)","v":"Limon argileux"}]
["Lorraine",3,11,null,null,null,5,"Argilo-calcaire superficiel",null,null,{"$f":"INDEX($A$23:$P$31,G8,PK!H5)","v":"Argilo-calcaire superficiel"}]
{"$rows_left_out":24}
{"sheet":"BDD_Engrais_PK","index":37,"n_rows":36,"n_cols":9,"rows_kept":36,"cut":false,"hidden":false,"merged":[]}
[]
[]
[null,"LES FERTILISANTS MINERAUX ET ORGANIQUES PK"]
[]
[]
[]
[]
[null,"Type de produit","Azote total (kg/t)","P2O5 (kg/t)","K2O (kg/t)","Equivalence N","Equivalence P","Equivalence K","MgO (kg/t)"]
{"$rows_left_out":29}
{"sheet":"Choix_engrais_phosphore","index":38,"n_rows":19,"n_cols":10,"rows_kept":19,"cut":false,"hidden":false,"merged":[[12,8,13,8]]}
[]
[]
[null,"CRITERES DE CHOIX DES ENGRAIS PHOSPHATES"]
[]
[]
[]
[]
[]
{"$rows_left_out":12}
{"sheet":"Feuil9","index":39,"n_rows":48,"n_cols":8,"rows_kept":48,"cut":false,"hidden":false,"merged":[]}
[]
[]
[]
[]
[]
[]
[null,"Phosphore",null,"Potasse",null,"Exigence P","Exigence K"]
["CULTURES","Récolte (grain / feuille)","Paille","Grain","Paille"]
{"$rows_left_out":41}
{"sheet":"BDD_Potasse","index":40,"n_rows":90,"n_cols":9,"rows_kept":90,"cut":false,"hidden":false,"merged":[[1,3,1,4],[1,5,1,6],[1,7,1,8]]}
[null,null,null,"Seuil Potasse en mg/kg"]
[null,null,null,"Forte exigence",null,"Moyenne exigence",null,"Faible exigence"]
[null,"Région","Type de sols","T renforcé","T impasse","T renforcé","T impasse","T renforcé","T impasse"]
[null,"Nord Picardie","Limons battants",170,300,120,180,80,150]
[null,"Nord Picardie","Limon argileux",200,400,150,220,100,150]
[null,"Nord Picardie","Argiles",250,450,200,270,150,200]
[null,"Nord Picardie","Cranettes",200,400,80,250,50,100]
[null,"Champagne Ardenne","Craie",200,400,80,250,50,100]
{"$rows_left_out":83}
{"sheet":"BDD_Phosphore","index":41,"n_rows":90,"n_cols":12,"rows_kept":90,"cut":false,"hidden":false,"merged":[[1,3,1,4],[1,5,1,6],[1,7,1,8]]}
[null,null,null,"Seuil P2O5 en mg/kg - Méthode Joret Hebert"]
[null,null,null,"Très exigeant",null,"Moyennement exigeant",null,"peu exigeant"]
[null,"Région","Type de sols","T renforcé","T impasse","T renforcé","T impasse","T renforcé","T impasse",null,"Code","Ligne"]
[null,"Nord Picardie","Limons battants",{"$f":"IF(PK!$E$5=1, BDD_Phosphore_JH!D4, IF(PK!$E$5=2, BDD_Phosphore_Olsen!C4, BDD_Phosphore_Dyer!C4))","v":50},{"$f":"IF(PK!$E$5=1, BDD_Phosphore_JH!E4, IF(PK!$E$5=2, BDD_Phosphore_Olsen!D4, BDD_Phosphore_Dyer!D4))","v":80},{"$f":"IF(PK!$E$5=1, BDD_Phosphore_JH!F4, IF(PK!$E$5=2, BDD_Phosphore_Olsen!E4, BDD_Phosphore_Dyer!E4))","v":50},{"$f":"IF(PK!$E$5=1, BDD_Phosphore_JH!G4, IF(PK!$E$5=2, BDD_Phosphore_Olsen!F4, BDD_Phosphore_Dyer!F4))","v":80},{"$f":"IF(PK!$E$5=1, BDD_Phosphore_JH!H4, IF(PK!$E$5=2, BDD_Phosphore_Olsen!G4, BDD_Phosphore_Dyer!G4))","v":20},{"$f":"IF(PK!$E$5=1, BDD_Phosphore_JH!I4, IF(PK!$E$5=2, BDD_Phosphore_Olsen!H4, BDD_Phosphore_Dyer!H4))","v":70},null,11,1]
[null,"Nord Picardie","Limon argileux",{"$f":"IF(PK!$E$5=1, BDD_Phosphore_JH!D5, IF(PK!$E$5=2, BDD_Phosphore_Olsen!C5, BDD_Phosphore_Dyer!C5))","v":50},{"$f":"IF(PK!$E$5=1, BDD_Phosphore_JH!E5, IF(PK!$E$5=2, BDD_Phosphore_Olsen!D5, BDD_Phosphore_Dyer!D5))","v":80},{"$f":"IF(PK!$E$5=1, BDD_Phosphore_JH!F5, IF(PK!$E$5=2, BDD_Phosphore_Olsen!E5, BDD_Phosphore_Dyer!E5))","v":50},{"$f":"IF(PK!$E$5=1, BDD_Phosphore_JH!G5, IF(PK!$E$5=2, BDD_Phosphore_Olsen!F5, BDD_Phosphore_Dyer!F5))","v":80},{"$f":"IF(PK!$E$5=1, BDD_Phosphore_JH!H5, IF(PK!$E$5=2, BDD_Phosphore_Olsen!G5, BDD_Phosphore_Dyer!G5))","v":20},{"$f":"IF(PK!$E$5=1, BDD_Phosphore_JH!I5, IF(PK!$E$5=2, BDD_Phosphore_Olsen!H5, BDD_Phosphore_Dyer!H5))","v":70},null,12,2]
[null,"Nord Picardie","Argiles",{"$f":"IF(PK!$E$5=1, BDD_Phosphore_JH!D6, IF(PK!$E$5=2, BDD_Phosphore_Olsen!C6, BDD_Phosphore_Dyer!C6))","v":50},{"$f":"IF(PK!$E$5=1, BDD_Phosphore_JH!E6, IF(PK!$E$5=2, BDD_Phosphore_Olsen!D6, BDD_Phosphore_Dyer!D6))","v":80},{"$f":"IF(PK!$E$5=1, BDD_Phosphore_JH!F6, IF(PK!$E$5=2, BDD_Phosphore_Olsen!E6, BDD_Phosphore_Dyer!E6))","v":50},{"$f":"IF(PK!$E$5=1, BDD_Phosphore_JH!G6, IF(PK!$E$5=2, BDD_Phosphore_Olsen!F6, BDD_Phosphore_Dyer!F6))","v":80},{"$f":"IF(PK!$E$5=1, BDD_Phosphore_JH!H6, IF(PK!$E$5=2, BDD_Phosphore_Olsen!G6, BDD_Phosphore_Dyer!G6))","v":20},{"$f":"IF(PK!$E$5=1, BDD_Phosphore_JH!I6, IF(PK!$E$5=2, BDD_Phosphore_Olsen!H6, BDD_Phosphore_Dyer!H6))","v":70},null,13,3]
[null,"Nord Picardie","Cranettes",{"$f":"IF(PK!$E$5=1, BDD_Phosphore_JH!D7, IF(PK!$E$5=2, BDD_Phosphore_Olsen!C7, BDD_Phosphore_Dyer!C7))","v":145},{"$f":"IF(PK!$E$5=1, BDD_Phosphore_JH!E7, IF(PK!$E$5=2, BDD_Phosphore_Olsen!D7, BDD_Phosphore_Dyer!D7))","v":210},{"$f":"IF(PK!$E$5=1, BDD_Phosphore_JH!F7, IF(PK!$E$5=2, BDD_Phosphore_Olsen!E7, BDD_Phosphore_Dyer!E7))","v":130},{"$f":"IF(PK!$E$5=1, BDD_Phosphore_JH!G7, IF(PK!$E$5=2, BDD_Phosphore_Olsen!F7, BDD_Phosphore_Dyer!F7))","v":150},{"$f":"IF(PK!$E$5=1, BDD_Phosphore_JH!H7, IF(PK!$E$5=2, BDD_Phosphore_Olsen!G7, BDD_Phosphore_Dyer!G7))","v":60},{"$f":"IF(PK!$E$5=1, BDD_Phosphore_JH!I7, IF(PK!$E$5=2, BDD_Phosphore_Olsen!H7, BDD_Phosphore_Dyer!H7))","v":135},null,14,4]
[null,"Champagne Ardenne","Craie",{"$f":"IF(PK!$E$5=1, BDD_Phosphore_JH!D8, IF(PK!$E$5=2, BDD_Phosphore_Olsen!C8, BDD_Phosphore_Dyer!C8))","v":145},{"$f":"IF(PK!$E$5=1, BDD_Phosphore_JH!E8, IF(PK!$E$5=2, BDD_Phosphore_Olsen!D8, BDD_Phosphore_Dyer!D8))","v":210},{"$f":"IF(PK!$E$5=1, BDD_Phosphore_JH!F8, IF(PK!$E$5=2, BDD_Phosphore_Olsen!E8, BDD_Phosphore_Dyer!E8))","v":130},{"$f":"IF(PK!$E$5=1, BDD_Phosphore_JH!G8, IF(PK!$E$5=2, BDD_Phosphore_Olsen!F8, BDD_Phosphore_Dyer!F8))","v":150},{"$f":"IF(PK!$E$5=1, BDD_Phosphore_JH!H8, IF(PK!$E$5=2, BDD_Phosphore_Olsen!G8, BDD_Phosphore_Dyer!G8))","v":60},{"$f":"IF(PK!$E$5=1, BDD_Phosphore_JH!I8, IF(PK!$E$5=2, BDD_Phosphore_Olsen!H8, BDD_Phosphore_Dyer!H8))","v":135},null,21,5]
{"$rows_left_out":83}
{"sheet":"BDD_Phosphore_JH","index":42,"n_rows":90,"n_cols":12,"rows_kept":90,"cut":false,"hidden":false,"merged":[[1,3,1,4],[1,5,1,6],[1,7,1,8]]}
[null,null,null,"Seuil P2O5 en mg/kg - Méthode Joret Hebert"]
[null,null,null,"Très exigeant",null,"Moyennement exigeant",null,"peu exigeant"]
[null,"Région","Type de sols","T renforcé","T impasse","T renforcé","T impasse","T renforcé","T impasse",null,"Code","Ligne"]
[null,"Nord Picardie","Limons battants",100,160,100,160,70,150,null,11,1]
[null,"Nord Picardie","Limon argileux",100,160,100,160,70,150,null,12,2]
[null,"Nord Picardie","Argiles",100,160,100,160,70,150,null,13,3]
[null,"Nord Picardie","Cranettes",280,400,250,300,200,260,null,14,4]
[null,"Champagne Ardenne","Craie",280,400,250,300,200,260,null,21,5]
{"$rows_left_out":83}
{"sheet":"BDD_Phosphore_Olsen","index":43,"n_rows":90,"n_cols":8,"rows_kept":90,"cut":false,"hidden":false,"merged":[[1,2,1,3],[1,4,1,5],[1,6,1,7]]}
[null,null,"Seuil P2O5 en mg/kg - Méthode Olsen"]
[null,null,"Forte exigence",null,"Moyenne exigence",null,"Faible exigence"]
["Région","Type de sols","T renforcé","T impasse","T renforcé","T impasse","T renforcé","T impasse"]
["Nord Picardie","Limons battants",50,80,50,80,20,70]
["Nord Picardie","Limon argileux",50,80,50,80,20,70]
["Nord Picardie","Argiles",50,80,50,80,20,70]
["Nord Picardie","Cranettes",145,210,130,150,60,135]
["Champagne Ardenne","Craie",145,210,130,150,60,135]
{"$rows_left_out":83}
{"sheet":"BDD_Phosphore_Dyer","index":44,"n_rows":90,"n_cols":8,"rows_kept":90,"cut":false,"hidden":false,"merged":[[1,2,1,3],[1,4,1,5],[1,6,1,7]]}
[null,null,"Seuil P2O5 en mg/kg - Méthode Dyer"]
[null,null,"Forte exigence",null,"Moyenne exigence",null,"Faible exigence"]
["Région","Type de sols","T renforcé","T impasse","T renforcé","T impasse","T renforcé","T impasse"]
["Nord Picardie","Limons battants",160,220,140,220,110,210]
["Nord Picardie","Limon argileux",160,220,140,220,110,210]
["Nord Picardie","Argiles",160,220,140,220,110,210]
["Nord Picardie","Cranettes"]
["Champagne Ardenne","Craie"]
{"$rows_left_out":83}
{"sheet":"Exigence_PK","index":45,"n_rows":22,"n_cols":3,"rows_kept":22,"cut":false,"hidden":false,"merged":[[3,1,3,2]]}
[]
["NIVEAU D'EXIGENCE EN PHOSPHORE ET POTASSE DES DIFFERENTES CULTURES"]
[]
[null,"NIVEAU D'EXIGENCE"]
["CULTURES","PHOSPHORE","POTASSE"]
["Betterave","Très exigeante","Très exigeante"]
["Colza","Très exigeante","Moyennement exigeante"]
["Luzerne","Très exigeante","Moyennement exigeante"]
{"$rows_left_out":15}
{"sheet":"Feuil6","index":46,"n_rows":0,"n_cols":0,"rows_kept":0,"cut":false,"hidden":false,"merged":[]}

{"sheet":"Feuil1","index":47,"n_rows":70,"n_cols":21,"rows_kept":70,"cut":false,"hidden":false,"merged":[]}
[null,null,"Culture","Numero ligne",{"$f":"'Chaulage (2)'!D17","v":6}]
[null,null,null,null,{"$f":"'Chaulage (2)'!D18","v":1}]
[null,null,null,null,{"$f":"'Chaulage (2)'!D19","v":1}]
[null,null,null,null,{"$f":"'Chaulage (2)'!D20","v":1}]
[null,null,null,null,{"$f":"'Chaulage (2)'!D21","v":1}]
[null,null,null,null,{"$f":"'Chaulage (2)'!D22","v":1}]
[null,null,null,null,{"$f":"'Chaulage (2)'!D23","v":1}]
[null,null,null,null,{"$f":"'Chaulage (2)'!D24","v":1}]
{"$rows_left_out":63}
{"sheet":"Ref_tab_graph","index":48,"n_rows":26,"n_cols":10,"rows_kept":26,"cut":false,"hidden":false,"merged":[]}
[]
[]
[]
[]
[]
[]
[4]
[4,"Valeur Indice de battance",null,{"$f":"Granulo!D12","v":1.2954545454545454},null,null,null,"Valeur sensibilité maladie et prise en masse",null,{"$f":"Granulo!J12","v":0}]
{"$rows_left_out":19}
{"sheet":"BDD_parcelles","index":49,"n_rows":8,"n_cols":2,"rows_kept":8,"cut":false,"hidden":false,"merged":[]}
[]
[]
[]
[]
[]
[null,"Nouvelle parcelle"]
[]
[null,"Les longues raies"]
{"$rows_left_out":1}
{"sheet":"Feuil2","index":50,"n_rows":8,"n_cols":2,"rows_kept":8,"cut":false,"hidden":false,"merged":[]}
[]
[]
[]
[]
[]
[]
["Argile",{"$f":"Granulo!D7","v":25}]
["Limon",{"$f":"SUM(Granulo!D8:D9)","v":65}]
{"$rows_left_out":1}
{"sheet":"Feuil3","index":51,"n_rows":14,"n_cols":5,"rows_kept":14,"cut":false,"hidden":false,"merged":[]}
[]
[]
[null,null,null,"x","y"]
[null,null,null,{"$f":"pH!E6","v":6.4},0]
[null,null,null,{"$f":"D4","v":6.4},8]
[]
[4,5.5]
[4,{"$f":"B7+1","v":6.5}]
{"$rows_left_out":7}
{"sheet":"Feuil5","index":52,"n_rows":11,"n_cols":4,"rows_kept":11,"cut":false,"hidden":false,"merged":[]}
[]
[]
[]
[]
[]
[]
[]
[]
{"$rows_left_out":4}
{"sheet":"Feuil4","index":53,"n_rows":0,"n_cols":0,"rows_kept":0,"cut":false,"hidden":false,"merged":[]}